justIN           Dashboard       Workflows       Jobs       AWT       Sites       Storages       Docs       Login

Jobsub ID 358239.178@justin-prod-sched01.dune.hep.ac.uk

Jobsub ID358239.178@justin-prod-sched01.dune.hep.ac.uk
Workflow ID5765
Stage ID1
User namecalcuttj@fnal.gov
HTCondor Groupgroup_dune
RequestedProcessors1
GPUNo
RSS bytes2096103424 (1999 MiB)
Wall seconds limit80000 (22 hours)
Submitted time2025-03-27 17:14:39
SiteUK_Edinburgh
EntryDUNE_UK_SGridECDF_ce1
Last heartbeat2025-03-27 17:30:42
From worker nodeHostnamenode2b01.ecdf.ed.ac.uk
cpuinfoIntel(R) Xeon(R) Gold 6338 CPU @ 2.00GHz
OS releaseScientific Linux release 7.9 (Nitrogen)
Processors1
RSS bytes2096103424 (1999 MiB)
Wall seconds limit171000 (47 hours)
GPU
Inner Apptainer?True
Job statejobscript_error
Allocator namejustin-allocator-pro.dune.hep.ac.uk
Started2025-03-27 17:30:20
Input fileshd-protodune:np04hd_raw_run027308_0025_dataflow3_datawriter_0_20240619T184543.hdf5
JobscriptExit code1
Real time0m (0s)
CPU time0m (0s = 0%)
Max RSS bytes0 (0 MiB)
Outputting started 
Output files
Finished2025-03-27 17:30:42
Saved logsjustin-logs:358239.178-justin-prod-sched01.dune.hep.ac.uk.logs.tgz
List job events     Wrapper job log

Jobscript log (last 10,000 characters)

5.5.5, dual-stack: false, private IPv4: false, private IPv6: false
[2025-03-27 17:30:26.770680 +0000][Debug  ][AsyncSock         ][ 1176] [cephc02.gla.scotgrid.ac.uk:1094.0] TLS hand-shake exchange.
[2025-03-27 17:30:26.777491 +0000][Debug  ][AsyncSock         ][ 1176] [cephc02.gla.scotgrid.ac.uk:1094.0] TLS hand-shake exchange.
[2025-03-27 17:30:26.782829 +0000][Debug  ][AsyncSock         ][ 1176] [cephc02.gla.scotgrid.ac.uk:1094.0] TLS hand-shake exchange.
[2025-03-27 17:30:26.782941 +0000][Info   ][AsyncSock         ][ 1176] [cephc02.gla.scotgrid.ac.uk:1094.0] TLS hand-shake done.
[2025-03-27 17:30:26.786954 +0000][Debug  ][XRootDTransport   ][ 1176] [cephc02.gla.scotgrid.ac.uk:1094.0] Logged in, session: 0f6d0000f9630e00290000005bf60000
[2025-03-27 17:30:26.786962 +0000][Debug  ][XRootDTransport   ][ 1176] [cephc02.gla.scotgrid.ac.uk:1094.0] Authentication is required: &P=ztn,0:4096:&P=gsi,v:10600,c:ssl,ca:530f7122.0|ffc3d59b.0
[2025-03-27 17:30:26.786971 +0000][Debug  ][XRootDTransport   ][ 1176] [cephc02.gla.scotgrid.ac.uk:1094.0] Sending authentication data
[2025-03-27 17:30:26.792190 +0000][Debug  ][XRootDTransport   ][ 1176] [cephc02.gla.scotgrid.ac.uk:1094.0] Trying to authenticate using ztn
[2025-03-27 17:30:26.792225 +0000][Debug  ][XRootDTransport   ][ 1176] [cephc02.gla.scotgrid.ac.uk:1094.0] Cannot get credentials for protocol ztn: Secztn: No token found; runtime fetch disallowed.
[2025-03-27 17:30:26.798420 +0000][Debug  ][XRootDTransport   ][ 1176] [cephc02.gla.scotgrid.ac.uk:1094.0] Trying to authenticate using gsi
[2025-03-27 17:30:26.853497 +0000][Debug  ][XRootDTransport   ][ 1176] [cephc02.gla.scotgrid.ac.uk:1094.0] Sending more authentication data for gsi
[2025-03-27 17:30:26.932860 +0000][Debug  ][XRootDTransport   ][ 1176] [cephc02.gla.scotgrid.ac.uk:1094.0] Authenticated with gsi.
[2025-03-27 17:30:26.932926 +0000][Debug  ][PostMaster        ][ 1176] [cephc02.gla.scotgrid.ac.uk:1094] Stream 0 connected (IPv4).
[2025-03-27 17:30:26.932945 +0000][Debug  ][Utility           ][ 1176] Monitor library name not set. No monitoring
[2025-03-27 17:30:26.933046 +0000][Debug  ][ExDbgMsg          ][ 1176] [cephc02.gla.scotgrid.ac.uk:1094] Moving MsgHandler: 0x31a0b60 (message: kXR_open (file: /cephfs/dune/RSE/hd-protodune/85/90/np04hd_raw_run027308_0025_dataflow3_datawriter_0_20240619T184543.hdf5, mode: 00, flags: kXR_open_read kXR_async kXR_retstat ) ) from out-queu to in-queue.
[2025-03-27 17:30:26.936974 +0000][Debug  ][ExDbgMsg          ][ 1176] [msg: 0x31e3550] Assigned MsgHandler: 0x31a0b60.
[2025-03-27 17:30:26.936981 +0000][Debug  ][ExDbgMsg          ][ 1176] [handler: 0x31a0b60] Removed MsgHandler: 0x31a0b60 from the in-queue.
[2025-03-27 17:30:26.937068 +0000][Debug  ][XRootD            ][ 1176] [cephc02.gla.scotgrid.ac.uk:1094] Handling error while processing kXR_open (file: /cephfs/dune/RSE/hd-protodune/85/90/np04hd_raw_run027308_0025_dataflow3_datawriter_0_20240619T184543.hdf5, mode: 00, flags: kXR_open_read kXR_async kXR_retstat ): [ERROR] Error response: permission denied.
[2025-03-27 17:30:26.937112 +0000][Debug  ][ExDbgMsg          ][ 1176] [cephc02.gla.scotgrid.ac.uk:1094] Calling MsgHandler: 0x31a0b60 (message: kXR_open (file: /cephfs/dune/RSE/hd-protodune/85/90/np04hd_raw_run027308_0025_dataflow3_datawriter_0_20240619T184543.hdf5, mode: 00, flags: kXR_open_read kXR_async kXR_retstat ) ) with status: [ERROR] Error response: permission denied.
[2025-03-27 17:30:26.937200 +0000][Debug  ][File              ][ 1176] [0x319b680@root://cephc02.gla.scotgrid.ac.uk:1094//cephfs/dune/RSE/hd-protodune/85/90/np04hd_raw_run027308_0025_dataflow3_datawriter_0_20240619T184543.hdf5?xrdcl.requuid=d45d5f35-353e-472a-a870-3441184b4797] Open has returned with status [ERROR] Server responded with an error: [3010] Unable to open /cephfs/dune/RSE/hd-protodune/85/90/np04hd_raw_run027308_0025_dataflow3_datawriter_0_20240619T184543.hdf5; permission denied
[2025-03-27 17:30:26.937214 +0000][Debug  ][File              ][ 1176] [0x319b680@root://cephc02.gla.scotgrid.ac.uk:1094//cephfs/dune/RSE/hd-protodune/85/90/np04hd_raw_run027308_0025_dataflow3_datawriter_0_20240619T184543.hdf5?xrdcl.requuid=d45d5f35-353e-472a-a870-3441184b4797] Error while opening at cephc02.gla.scotgrid.ac.uk:1094: [ERROR] Server responded with an error: [3010] Unable to open /cephfs/dune/RSE/hd-protodune/85/90/np04hd_raw_run027308_0025_dataflow3_datawriter_0_20240619T184543.hdf5; permission denied
[2025-03-27 17:30:26.937250 +0000][Debug  ][ExDbgMsg          ][ 1176] [cephc02.gla.scotgrid.ac.uk:1094] Destroying MsgHandler: 0x31a0b60.
HDF5-DIAG: Error detected in HDF5 (1.12.2) thread 0:
  #000: /scratch/workspace/build-single/BUILDTYPE/prof/QUAL/e26/label1/swarm/label2/SLF7/build/hdf5/v1_12_2a/source/hdf5-1.12.2/src/H5F.c line 620 in H5Fopen(): unable to open file
    major: File accessibility
    minor: Unable to open file
  #001: /scratch/workspace/build-single/BUILDTYPE/prof/QUAL/e26/label1/swarm/label2/SLF7/build/hdf5/v1_12_2a/source/hdf5-1.12.2/src/H5VLcallback.c line 3501 in H5VL_file_open(): failed to iterate over available VOL connector plugins
    major: Virtual Object Layer
    minor: Iteration failed
  #002: /scratch/workspace/build-single/BUILDTYPE/prof/QUAL/e26/label1/swarm/label2/SLF7/build/hdf5/v1_12_2a/source/hdf5-1.12.2/src/H5PLpath.c line 578 in H5PL__path_table_iterate(): can't iterate over plugins in plugin path '(null)'
    major: Plugin for dynamically loaded library
    minor: Iteration failed
  #003: /scratch/workspace/build-single/BUILDTYPE/prof/QUAL/e26/label1/swarm/label2/SLF7/build/hdf5/v1_12_2a/source/hdf5-1.12.2/src/H5PLpath.c line 620 in H5PL__path_table_iterate_process_path(): can't open directory: /usr/local/hdf5/lib/plugin
    major: Plugin for dynamically loaded library
    minor: Can't open directory or file
  #004: /scratch/workspace/build-single/BUILDTYPE/prof/QUAL/e26/label1/swarm/label2/SLF7/build/hdf5/v1_12_2a/source/hdf5-1.12.2/src/H5VLcallback.c line 3351 in H5VL__file_open(): open failed
    major: Virtual Object Layer
    minor: Can't open object
  #005: /scratch/workspace/build-single/BUILDTYPE/prof/QUAL/e26/label1/swarm/label2/SLF7/build/hdf5/v1_12_2a/source/hdf5-1.12.2/src/H5VLnative_file.c line 97 in H5VL__native_file_open(): unable to open file
    major: File accessibility
    minor: Unable to open file
  #006: /scratch/workspace/build-single/BUILDTYPE/prof/QUAL/e26/label1/swarm/label2/SLF7/build/hdf5/v1_12_2a/source/hdf5-1.12.2/src/H5Fint.c line 1834 in H5F_open(): unable to open file: name = 'root://cephc02.gla.scotgrid.ac.uk:1094//cephfs/dune/RSE/hd-protodune/85/90/np04hd_raw_run027308_0025_dataflow3_datawriter_0_20240619T184543.hdf5', tent_flags = 0
    major: File accessibility
    minor: Unable to open file
  #007: /scratch/workspace/build-single/BUILDTYPE/prof/QUAL/e26/label1/swarm/label2/SLF7/build/hdf5/v1_12_2a/source/hdf5-1.12.2/src/H5FD.c line 723 in H5FD_open(): open failed
    major: Virtual File Layer
    minor: Unable to initialize object
  #008: /scratch/workspace/build-single/BUILDTYPE/prof/QUAL/e26/label1/swarm/label2/SLF7/build/hdf5/v1_12_2a/source/hdf5-1.12.2/src/H5FDsec2.c line 352 in H5FD__sec2_open(): unable to open file: name = 'root://cephc02.gla.scotgrid.ac.uk:1094//cephfs/dune/RSE/hd-protodune/85/90/np04hd_raw_run027308_0025_dataflow3_datawriter_0_20240619T184543.hdf5', errno = 13, error message = 'Permission denied', flags = 0, o_flags = 0
    major: File accessibility
    minor: Unable to open file

====================================================================================================================
TimeTracker printout (sec)            Min           Avg           Max         Median          RMS         nEvts   
====================================================================================================================
[ No processed events ]
====================================================================================================================

TrigReport ---------- Event summary -------------
TrigReport Events total = 0 passed = 0 failed = 0

TrigReport ---------- Modules in End-path ----------
TrigReport        Run    Success      Error Name
TrigReport          0          0          0 out1

TimeReport ---------- Time summary [sec] -------
TimeReport CPU = 0.113231 Real = 0.181267

MemReport  ---------- Memory summary [base-10 MB] ------
MemReport  VmPeak = 965.317 VmHWM = 304.153

%MSG-s ArtException:  PostEndJob 27-Mar-2025 17:30:26 GMT ModuleEndJob
---- HDF5RawDataFile BEGIN
   File open failure: root://cephc02.gla.scotgrid.ac.uk:1094//cephfs/dune/RSE/hd-protodune/85/90/np04hd_raw_run027308_0025_dataflow3_datawriter_0_20240619T184543.hdf5 Unable to open file root://cephc02.gla.scotgrid.ac.uk:1094//cephfs/dune/RSE/hd-protodune/85/90/np04hd_raw_run027308_0025_dataflow3_datawriter_0_20240619T184543.hdf5 (File accessibility) Unable to open file
---- HDF5RawDataFile END
%MSG
Art has completed and will exit with status 1.
[2025-03-27 17:30:26.992869 +0000][Debug  ][JobMgr            ][ 1176] Stopping the job manager...
[2025-03-27 17:30:26.993125 +0000][Debug  ][JobMgr            ][ 1176] Job manager stopped
[2025-03-27 17:30:26.993144 +0000][Debug  ][TaskMgr           ][ 1176] Stopping the task manager...
[2025-03-27 17:30:26.993306 +0000][Debug  ][TaskMgr           ][ 1176] Task manager stopped
[2025-03-27 17:30:26.993315 +0000][Debug  ][Poller            ][ 1176] Stopping the poller...
[2025-03-27 17:30:26.993574 +0000][Debug  ][AsyncSock         ][ 1176] [cephc02.gla.scotgrid.ac.uk:1094.0] Closing the socket
[2025-03-27 17:30:26.993599 +0000][Debug  ][Poller            ][ 1176] <[::ffff:192.41.105.34]:33658><--><[::ffff:130.209.239.113]:1094> Removing socket from the poller
[2025-03-27 17:30:26.993801 +0000][Debug  ][PostMaster        ][ 1176] [cephc02.gla.scotgrid.ac.uk:1094] Destroying stream
[2025-03-27 17:30:26.993888 +0000][Debug  ][AsyncSock         ][ 1176] [cephc02.gla.scotgrid.ac.uk:1094.0] Closing the socket
justIN time: 2025-04-03 08:27:28 UTC       justIN version: 01.03.00